BDBM50235369 CHEMBL3930990
SMILES COc1ccc(cc1)N(C(=O)OC[C@@H]1CC[C@H](COCC(O)=O)CC1)c1ccccc1
InChI Key InChIKey=JXNOKAGQNHMCNO-KDURUIRLSA-N
Data  2 EC50
  Tab Delimited (TSV)   2D SDfile   Computed 3D by Vconf -m prep SDfile
Find this compound or compounds like it in BindingDB:
Activity Spreadsheet -- Enzyme Inhibition Constant Data from BindingDB
Found 2 hits for monomerid = 50235369
TargetProstacyclin receptor(Homo sapiens (Human))
Arena Pharmaceuticals
Curated by ChEMBL
LigandPNGBDBM50235369(CHEMBL3930990)
Affinity DataEC50:  1.63E+3nM. Assay description: Agonist activity at recombinant human IP receptor expressed in CHO-K1 cells assessed as increase in intracellular cAMP level after 1 hr incubation by...
In DepthDetails ArticlePubMed
TargetProstacyclin receptor(RAT)
Arena Pharmaceuticals
Curated by ChEMBL
LigandPNGBDBM50235369(CHEMBL3930990)
Affinity DataEC50: >1.00E+4nM. Assay description: Agonist activity at recombinant rat IP receptor expressed in CHO-K1 cells assessed as increase in intracellular cAMP level after 1 hr incubation by H...
In DepthDetails ArticlePubMed