BDBM50235652 CHEMBL4066584
SMILES CN(C)[C@H]1CN(C[C@@H]1c1cn(C)c2ccccc12)[C@@H]1CCc2cccc(F)c12
InChI Key InChIKey=XAWMNFFOVCNWGF-PTUXOGIPSA-N
Data  1 KI
  Tab Delimited (TSV)   2D SDfile   Computed 3D by Vconf -m prep SDfile
Find this compound or compounds like it in BindingDB:
Activity Spreadsheet -- Enzyme Inhibition Constant Data from BindingDB
Found 1 hit for monomerid = 50235652
TargetPolycomb protein EED(Homo sapiens (Human))
Abbvie
Curated by ChEMBL
LigandPNGBDBM50235652(CHEMBL4066584)
Affinity DataKi:  129nM. Assay description: In vitro test for inhibitory activity against human dipeptidyl peptidase IV.
In DepthDetails ArticlePubMed