BDBM50235679 CHEMBL4066599
SMILES CCOC(=O)c1nn(-c2ccc(cc2)S(N)(=O)=O)c2nc3nc(cc(-c4ccc(cc4)[N+]([O-])=O)c3c(=O)n12)-c1cccs1
InChI Key InChIKey=AKMXJPBORPRBLQ-UHFFFAOYSA-N
Data  4 KI
  Tab Delimited (TSV)   2D SDfile   Computed 3D by Vconf -m prep SDfile
Find this compound or compounds like it in BindingDB:
Activity Spreadsheet -- Enzyme Inhibition Constant Data from BindingDB
Found 4 hits for monomerid = 50235679
TargetCarbonic anhydrase 9(Homo sapiens (Human))
University Of Wollongong
Curated by ChEMBL
LigandPNGBDBM50235679(CHEMBL4066599)
Affinity DataKi:  1.10E+3nM. Assay description: Inhibition of neutral endopeptidase in human umbilical vein endothelial cells
In DepthDetails ArticlePubMed
TargetCarbonic anhydrase 2(Homo sapiens (Human))
University Of Wollongong
Curated by ChEMBL
LigandPNGBDBM50235679(CHEMBL4066599)
Affinity DataKi:  1.75E+3nM. Assay description: Inhibition of human platelet adhesion to fibrinogen
In DepthDetails ArticlePubMed
TargetCarbonic anhydrase 4(Homo sapiens (Human))
University Of Wollongong
Curated by ChEMBL
LigandPNGBDBM50235679(CHEMBL4066599)
Affinity DataKi:  2.98E+3nM. Assay description: Inhibition of recombinant human membrane-associated carbonic anhydrase 4 assessed as inhibition of CO2 hydration preincubated for 15 mins prior to te...
In DepthDetails ArticlePubMed
TargetCarbonic anhydrase 1(Homo sapiens (Human))
University Of Wollongong
Curated by ChEMBL
LigandPNGBDBM50235679(CHEMBL4066599)
Affinity DataKi:  8.71E+3nM. Assay description: Binding affinity against Gamma-aminobutyric acid type B receptor in rat brain synaptosomes after 30 minutes
In DepthDetails ArticlePubMed