BDBM50235683 CHEMBL4062664
SMILES CC(=O)c1nn(-c2ccc(cc2)S(N)(=O)=O)c2nc3nc(cc(-c4ccc(cc4)[N+]([O-])=O)c3c(=O)n12)-c1ccc(Cl)cc1
InChI Key InChIKey=UWAUWBRWRNCNBI-UHFFFAOYSA-N
Data  4 KI
  Tab Delimited (TSV)   2D SDfile   Computed 3D by Vconf -m prep SDfile
Find this compound or compounds like it in BindingDB:
Activity Spreadsheet -- Enzyme Inhibition Constant Data from BindingDB
Found 4 hits for monomerid = 50235683
TargetCarbonic anhydrase 9(Homo sapiens (Human))
University Of Wollongong
Curated by ChEMBL
LigandPNGBDBM50235683(CHEMBL4062664)
Affinity DataKi:  330nM. Assay description: Inhibition of recombinant human tumor-associated carbonic anhydrase 9 assessed as inhibition of CO2 hydration preincubated for 15 mins prior to testi...
In DepthDetails ArticlePubMed
TargetCarbonic anhydrase 2(Homo sapiens (Human))
University Of Wollongong
Curated by ChEMBL
LigandPNGBDBM50235683(CHEMBL4062664)
Affinity DataKi:  860nM. Assay description: Inhibition of recombinant human carbonic anhydrase 2 assessed as inhibition of CO2 hydration preincubated for 15 mins prior to testing by phenol red ...
In DepthDetails ArticlePubMed
TargetCarbonic anhydrase 4(Homo sapiens (Human))
University Of Wollongong
Curated by ChEMBL
LigandPNGBDBM50235683(CHEMBL4062664)
Affinity DataKi:  2.92E+3nM. Assay description: Inhibition of recombinant human membrane-associated carbonic anhydrase 4 assessed as inhibition of CO2 hydration preincubated for 15 mins prior to te...
In DepthDetails ArticlePubMed
TargetCarbonic anhydrase 1(Homo sapiens (Human))
University Of Wollongong
Curated by ChEMBL
LigandPNGBDBM50235683(CHEMBL4062664)
Affinity DataKi:  5.52E+3nM. Assay description: Inhibition of recombinant human cytosolic carbonic anhydrase 1 assessed as inhibition of CO2 hydration preincubated for 15 mins prior to testing by p...
In DepthDetails ArticlePubMed