BDBM50235698 CHEMBL4069070
SMILES COc1ccc(OC)c(Sc2cccc3[nH]c4nc(N)nc(N)c4c23)c1
InChI Key InChIKey=TXHGXJGNQUMSBD-UHFFFAOYSA-N
Data  5 IC50
  Tab Delimited (TSV)   2D SDfile   Computed 3D by Vconf -m prep SDfile
Find this compound or compounds like it in BindingDB:
Activity Spreadsheet -- Enzyme Inhibition Constant Data from BindingDB
Found 5 hits for monomerid = 50235698
TargetPlatelet-derived growth factor receptor beta(Homo sapiens (Human))
Duquesne University
Curated by ChEMBL
LigandPNGBDBM50235698(CHEMBL4069070)
Affinity DataIC50: >2.00E+5nM. Assay description: Ability to compete for binding to Class II MHC using ELISA assay.
In DepthDetails ArticlePubMed
TargetDihydrofolate reductase(Homo sapiens (Human))
Duquesne University
Curated by ChEMBL
LigandPNGBDBM50235698(CHEMBL4069070)
Affinity DataIC50: >2.70E+4nM. Assay description: Inhibition of human DHFR using dihydrofolate as substrate by spectrophotometric method
In DepthDetails ArticlePubMed
TargetVascular endothelial growth factor receptor 2(Homo sapiens (Human))
Duquesne University
Curated by ChEMBL
LigandPNGBDBM50235698(CHEMBL4069070)
Affinity DataIC50:  1.02E+4nM. Assay description: Inhibition of VEGF-induced VEGFR2 phosphorylation in human U251 cells preincubated for 60 mins followed by VEGF induction measured after 10 mins by E...
In DepthDetails ArticlePubMed
TargetEpidermal growth factor receptor(Homo sapiens (Human))
Duquesne University
Curated by ChEMBL
LigandPNGBDBM50235698(CHEMBL4069070)
Affinity DataIC50:  4.30E+3nM. Assay description: Inhibition of EGF-induced EGFR phosphorylation in human A431 cells preincubated for 60 mins followed by EGF induction measured after 10 mins by ELISA
In DepthDetails ArticlePubMed
TargetPolyunsaturated fatty acid lipoxygenase ALOX15B(Rattus norvegicus)
Duquesne University
Curated by ChEMBL
LigandPNGBDBM50235698(CHEMBL4069070)
Affinity DataIC50:  1.10E+3nM. Assay description: Inhibition of human thymidylate synthase using dUMP/(6R,S)-tetrahydrofolate as substrate/co-factor by spectrophotometric method
In DepthDetails ArticlePubMed