BDBM50235854 (S)-2-(5-(2-(2,3-dichlorobenzyloxy)-1-(2-amino-2-methylpropanamido)ethyl)-1H-tetrazol-1-yl)ethyl 4-hydroxybutylcarbamate::CHEMBL401827
SMILES CC(C)(N)C(=O)N[C@H](COCc1cccc(Cl)c1Cl)c1nnnn1CCOC(=O)NCCCCO
InChI Key InChIKey=FHQOGHRARWSWER-MRXNPFEDSA-N
Data  1 EC50
  Tab Delimited (TSV)   2D SDfile   Computed 3D by Vconf -m prep SDfile
Find this compound or compounds like it in BindingDB:
Activity Spreadsheet -- Enzyme Inhibition Constant Data from BindingDB
Found 1 hit for monomerid = 50235854
TargetGrowth hormone secretagogue receptor type 1(Homo sapiens (Human))
Bristol Myers Squibb
Curated by ChEMBL
LigandPNGBDBM50235854((S)-2-(5-(2-(2,3-dichlorobenzyloxy)-1-(2-amino-2-m...)
Affinity DataEC50:  0.610nM. Assay description: Inhibition of human growth hormone secretagogue receptor assessed as measuring intracellular calcium level by FLIPR assay
In DepthDetails ArticlePubMed