BDBM50236222 CHEMBL4101611
SMILES C(CCCOc1ccccc1-c1ccccc1)CCCn1cc(nn1)-c1cccnc1
InChI Key InChIKey=SAFWLJCYESLBCY-UHFFFAOYSA-N
Data  1 IC50
  Tab Delimited (TSV)   2D SDfile   Computed 3D by Vconf -m prep SDfile
Find this compound or compounds like it in BindingDB:
Activity Spreadsheet -- Enzyme Inhibition Constant Data from BindingDB
Found 1 hit for monomerid = 50236222
TargetNicotinamide phosphoribosyltransferase(Mus musculus)
Universit£
Curated by ChEMBL
LigandPNGBDBM50236222(CHEMBL4101611)
Affinity DataIC50:  31nM. Assay description: Inhibition of recombinant mouse NAMPT expressed in bacterial expression system using nicotinamide as substrate after 1 hr by fluorescence based NMNAT...
In DepthDetails ArticlePubMed