BDBM50236266 7-[(1E)-1-(methoxyimino)ethyl]-19-methyl-3,13,19,20-tetraazahexacyclo[14.7.0.0^{2,10}.0^{4,9}.0^{11,15}.0^{17,21}]tricosa-1(16),2(10),4,6,8,11(15),17,20-octaen-14-one::CHEMBL257789
SMILES CO\N=C(/C)c1ccc2[nH]c3c4CCc5nn(C)cc5-c4c4C(=O)NCc4c3c2c1
InChI Key InChIKey=BIGLUOGTKFYENL-LUOAPIJWSA-N
Data  2 IC50
  Tab Delimited (TSV)   2D SDfile   Computed 3D by Vconf -m prep SDfile
Find this compound or compounds like it in BindingDB:
Activity Spreadsheet -- Enzyme Inhibition Constant Data from BindingDB
Found 2 hits for monomerid = 50236266
TargetAngiopoietin-1 receptor(Homo sapiens (Human))
Cephalon
Curated by ChEMBL
LigandPNGBDBM50236266(7-[(1E)-1-(methoxyimino)ethyl]-19-methyl-3,13,19,2...)
Affinity DataIC50:  71nM. Assay description: Inhibition of human recombinant TIE2 by HTRF assay
In DepthDetails ArticlePubMed
TargetVascular endothelial growth factor receptor 2(Homo sapiens (Human))
Cephalon
Curated by ChEMBL
LigandPNGBDBM50236266(7-[(1E)-1-(methoxyimino)ethyl]-19-methyl-3,13,19,2...)
Affinity DataIC50:  1nM. Assay description: Inhibition of human recombinant VEGFR2 by HTRF assay
In DepthDetails ArticlePubMed