BDBM50236622 CHEMBL4093788
SMILES Cc1cc(COc2ccc(cc2)S(=O)(=O)N[C@H]2CCCC[C@@H]2C(=O)NO)c2ccccc2n1
InChI Key InChIKey=PRUBEBCKVHQBST-GMAHTHKFSA-N
Data  4 IC50
  Tab Delimited (TSV)   2D SDfile   Computed 3D by Vconf -m prep SDfile
Find this compound or compounds like it in BindingDB:
Activity Spreadsheet -- Enzyme Inhibition Constant Data from BindingDB
Found 4 hits for monomerid = 50236622
TargetDisintegrin and metalloproteinase domain-containing protein 17(Mus musculus (Mouse))
Nestl�
Curated by ChEMBL
LigandPNGBDBM50236622(CHEMBL4093788)
Affinity DataIC50:  60nM. Assay description: Inhibition of TACE in mouse RAW264.7 cells assessed as inhibition of LPS-stimulated TNFalpha production pretreated for 1 hr followed by LPS stimulati...
In DepthDetails ArticlePubMed
TargetDisintegrin and metalloproteinase domain-containing protein 17(Homo sapiens (Human))
Nestl�
Curated by ChEMBL
LigandPNGBDBM50236622(CHEMBL4093788)
Affinity DataIC50:  1.80nM. Assay description: Inhibition of recombinant TACE catalytic domain (unknown origin) using Abz-LAQAVRSSSR-Dpa as substrate preincubated for 10 mins followed by substrate...
In DepthDetails ArticlePubMed
TargetDisintegrin and metalloproteinase domain-containing protein 17(Mus musculus (Mouse))
Nestl�
Curated by ChEMBL
LigandPNGBDBM50236622(CHEMBL4093788)
Affinity DataIC50:  63nM. Assay description: Compound was tested for agonistic activity at Glutamate receptor 6 using HEK293 cells
In DepthDetails ArticlePubMed
TargetDisintegrin and metalloproteinase domain-containing protein 17(Homo sapiens (Human))
Nestl�
Curated by ChEMBL
LigandPNGBDBM50236622(CHEMBL4093788)
Affinity DataIC50:  1.80nM. Assay description: Inhibition of recombinant TACE catalytic domain (unknown origin) using Abz-LAQAVRSSSR-Dpa as substrate preincubated for 10 mins followed by substrate...
In DepthDetails ArticlePubMed