BDBM50236952 CHEMBL2237709
SMILES COc1ccc(\C=C\C(=O)c2cccnc2)c(OC)c1OC
InChI Key InChIKey=BJLXVSGXKPEVHK-SOFGYWHQSA-N
Data  9 IC50
  Tab Delimited (TSV)   2D SDfile   Computed 3D by Vconf -m prep SDfile
Find this compound or compounds like it in BindingDB:
Activity Spreadsheet -- Enzyme Inhibition Constant Data from BindingDB
Found 9 hits for monomerid = 50236952
TargetCytochrome P450 3A4(Homo sapiens (Human))
De Montfort University
Curated by ChEMBL
LigandPNGBDBM50236952(CHEMBL2237709)
Affinity DataIC50:  1.18E+4nM. Assay description: Inhibition of human liver CYP3A4 expressed in Saccharomyces cerevisiae YY7 microsomal membranes using DBF as substrate after 10 mins by fluorescence ...
In DepthDetails ArticlePubMed
TargetCytochrome P450 2D6(Homo sapiens (Human))
De Montfort University
Curated by ChEMBL
LigandPNGBDBM50236952(CHEMBL2237709)
Affinity DataIC50:  8.80E+3nM. Assay description: Inhibition of human liver CYP2D6 expressed in Saccharomyces cerevisiae YY7 microsomal membranes using EOMCC as substrate after 10 mins by fluorescenc...
In DepthDetails ArticlePubMed
TargetCytochrome P450 2C9(Homo sapiens (Human))
De Montfort University
Curated by ChEMBL
LigandPNGBDBM50236952(CHEMBL2237709)
Affinity DataIC50: >2.00E+4nM. Assay description: Inhibition of human liver CYP2C9 expressed in Saccharomyces cerevisiae YY7 microsomal membranes using DBF as substrate after 10 mins by fluorescence ...
In DepthDetails ArticlePubMed
TargetCytochrome P450 1A1(Homo sapiens (Human))
De Montfort University
Curated by ChEMBL
LigandPNGBDBM50236952(CHEMBL2237709)
Affinity DataIC50:  297nM. Assay description: Inhibition of human liver CYP1A1 expressed in Saccharomyces cerevisiae YY7 microsomal membranes using 7-ethoxyresorufin as substrate after 10 mins by...
In DepthDetails ArticlePubMed
TargetTrophozoite cysteine proteinase(Plasmodium falciparum)TBA
LigandPNGBDBM50236952(CHEMBL2237709)
Affinity DataIC50:  3.90E+3nM. Assay description: Inhibition of Plasmodium falciparum W2 cysteine protease
In DepthDetails Article
TargetCytochrome P450 2C19(Homo sapiens (Human))
De Montfort University
Curated by ChEMBL
LigandPNGBDBM50236952(CHEMBL2237709)
Affinity DataIC50: >2.00E+4nM. Assay description: Inhibition of human liver CYP2C19 expressed in Saccharomyces cerevisiae YY7 microsomal membranes using DBF as substrate after 10 mins by fluorescence...
In DepthDetails ArticlePubMed
TargetCytochrome P450 1A2(Homo sapiens (Human))
De Montfort University
Curated by ChEMBL
LigandPNGBDBM50236952(CHEMBL2237709)
Affinity DataIC50:  168nM. Assay description: Inhibition of human liver CYP1A2 expressed in Saccharomyces cerevisiae YY7 microsomal membranes using CEC as substrate after 10 mins by fluorescence ...
In DepthDetails ArticlePubMed
TargetTrophozoite cysteine proteinase(Plasmodium falciparum)TBA
LigandPNGBDBM50236952(CHEMBL2237709)
Affinity DataIC50:  3.90E+3nM. Assay description: Inhibition of Plasmodium falciparum W2 cysteine protease
In DepthDetails Article
TargetCytochrome P450 1B1(Homo sapiens (Human))
De Montfort University
Curated by ChEMBL
LigandPNGBDBM50236952(CHEMBL2237709)
Affinity DataIC50:  31nM. Assay description: Inhibition of human liver CYP1B1 expressed in Saccharomyces cerevisiae YY7 microsomal membranes using 7-ethoxyresorufin as substrate after 10 mins by...
In DepthDetails ArticlePubMed