BDBM50237045 CHEMBL4073007
SMILES Fc1cnc(nc1N(Cc1ccc2OCOc2c1)C1CCCCC1)C#N
InChI Key InChIKey=QTVPDZJZFZDWSN-UHFFFAOYSA-N
Data  1 KI
  Tab Delimited (TSV)   2D SDfile   Computed 3D by Vconf -m prep SDfile
Find this compound or compounds like it in BindingDB:
Activity Spreadsheet -- Enzyme Inhibition Constant Data from BindingDB
Found 1 hit for monomerid = 50237045
TargetProcathepsin L(Homo sapiens (Human))
Roche Pharmaceutical Research And Early Development (Pred)
Curated by ChEMBL
LigandPNGBDBM50237045(CHEMBL4073007)
Affinity DataKi:  200nM. Assay description: Inhibition of human Cathepsin L
In DepthDetails ArticlePubMed