BDBM50237047 CHEMBL4088718
SMILES Brc1cccc(Nc2ncnc3ccc(NC(=S)NCc4ccccc4)cc23)c1
InChI Key InChIKey=YVUKGISJTJAKGC-UHFFFAOYSA-N
Data  2 IC50
  Tab Delimited (TSV)   2D SDfile   Computed 3D by Vconf -m prep SDfile
Find this compound or compounds like it in BindingDB:
Activity Spreadsheet -- Enzyme Inhibition Constant Data from BindingDB
Found 2 hits for monomerid = 50237047
TargetReceptor-interacting serine/threonine-protein kinase 2(Homo sapiens (Human))
Saarland University
Curated by ChEMBL
LigandPNGBDBM50237047(CHEMBL4088718)
Affinity DataIC50: >1.00E+4nM. Assay description: Inhibition of TNFalpha-stimulated RIPK2 in human U937 cells in presence of 5 uM ATP
In DepthDetails ArticlePubMed
TargetEpidermal growth factor receptor(Homo sapiens (Human))
Saarland University
Curated by ChEMBL
LigandPNGBDBM50237047(CHEMBL4088718)
Affinity DataIC50:  17nM. Assay description: Inhibitory concentration against rabbit muscle glyceraldehyde-3-phosphate dehydrogenase (GAPDH)
In DepthDetails ArticlePubMed