BDBM50237079 2-(3-cyanophenoxy)-N-(2-(5-methylfuran-2-yl)-6-(thiazol-2-yl)pyrimidin-4-yl)acetamide::CHEMBL255860
SMILES Cc1ccc(o1)-c1nc(NC(=O)COc2cccc(c2)C#N)cc(n1)-c1nccs1
InChI Key InChIKey=BTRDGDNHKGWPRJ-UHFFFAOYSA-N
Data  2 KI
  Tab Delimited (TSV)   2D SDfile   Computed 3D by Vconf -m prep SDfile
Find this compound or compounds like it in BindingDB:
Activity Spreadsheet -- Enzyme Inhibition Constant Data from BindingDB
Found 2 hits for monomerid = 50237079
TargetAdenosine receptor A2a(Homo sapiens (Human))
Neurocrine Biosciences
Curated by ChEMBL
LigandPNGBDBM50237079(2-(3-cyanophenoxy)-N-(2-(5-methylfuran-2-yl)-6-(th...)
Affinity DataKi:  6.80nM. Assay description: Displacement of [3H]-ZM241385 from human adenosine A2A receptor expressed in HEK293 cells
In DepthDetails ArticlePubMed
TargetAdenosine receptor A1(Homo sapiens (Human))
Neurocrine Biosciences
Curated by ChEMBL
LigandPNGBDBM50237079(2-(3-cyanophenoxy)-N-(2-(5-methylfuran-2-yl)-6-(th...)
Affinity DataKi:  4.30E+3nM. Assay description: Displacement of [3H]-DPCPX from human adenosine A1 receptor expressed in HEK293 cells
In DepthDetails ArticlePubMed