BDBM50237099 CHEMBL4066504
SMILES Fc1ccc(NC(=S)Nc2ccc3ncnc(Nc4cccc(Br)c4)c3c2)cc1Cl
InChI Key InChIKey=LQHGLEHALIXLBR-UHFFFAOYSA-N
Data  1 IC50
  Tab Delimited (TSV)   2D SDfile   Computed 3D by Vconf -m prep SDfile
Find this compound or compounds like it in BindingDB:
Activity Spreadsheet -- Enzyme Inhibition Constant Data from BindingDB
Found 1 hit for monomerid = 50237099
TargetEpidermal growth factor receptor(Homo sapiens (Human))
Saarland University
Curated by ChEMBL
LigandPNGBDBM50237099(CHEMBL4066504)
Affinity DataIC50:  25nM. Assay description: Inhibition of human recombinant GST-tagged EGFR (668 to 1210 residues) cytoplasmic domain expressed in baculovirus expression system
In DepthDetails ArticlePubMed