BDBM50237106 CHEMBL4072928
SMILES Clc1ccc(NC(=S)Nc2ccc3ncnc(Nc4cccc(Br)c4)c3c2)cc1Cl
InChI Key InChIKey=IOUMFXYNKGJRCF-UHFFFAOYSA-N
Data  1 IC50
  Tab Delimited (TSV)   2D SDfile   Computed 3D by Vconf -m prep SDfile
Find this compound or compounds like it in BindingDB:
Activity Spreadsheet -- Enzyme Inhibition Constant Data from BindingDB
Found 1 hit for monomerid = 50237106
TargetEpidermal growth factor receptor(Homo sapiens (Human))
Saarland University
Curated by ChEMBL
LigandPNGBDBM50237106(CHEMBL4072928)
Affinity DataIC50:  133nM. Assay description: Inhibition of human recombinant GST-tagged EGFR (668 to 1210 residues) cytoplasmic domain expressed in baculovirus expression system
In DepthDetails ArticlePubMed