BDBM50237119 CHEMBL4079151
SMILES Oc1ccc(Nc2ncnc3ccc(NC(=S)NCc4ccccc4)cc23)cc1
InChI Key InChIKey=YLPUENLJHNGVLQ-UHFFFAOYSA-N
Data  1 IC50
  Tab Delimited (TSV)   2D SDfile   Computed 3D by Vconf -m prep SDfile
Find this compound or compounds like it in BindingDB:
Activity Spreadsheet -- Enzyme Inhibition Constant Data from BindingDB
Found 1 hit for monomerid = 50237119
TargetEpidermal growth factor receptor(Homo sapiens (Human))
Saarland University
Curated by ChEMBL
LigandPNGBDBM50237119(CHEMBL4079151)
Affinity DataIC50: >150nM. Assay description: Inhibition of human recombinant GST-tagged EGFR (668 to 1210 residues) cytoplasmic domain expressed in baculovirus expression system
In DepthDetails ArticlePubMed