BDBM50237132 CHEMBL4071959
SMILES O=C(\C=C\c1cccnc1)c1cccc2ccccc12
InChI Key InChIKey=PGWOBCNTPPHTAD-ZHACJKMWSA-N
Data  7 IC50
  Tab Delimited (TSV)   2D SDfile   Computed 3D by Vconf -m prep SDfile
Find this compound or compounds like it in BindingDB:
Activity Spreadsheet -- Enzyme Inhibition Constant Data from BindingDB
Found 7 hits for monomerid = 50237132
TargetCytochrome P450 2C9(Homo sapiens (Human))
De Montfort University
Curated by ChEMBL
LigandPNGBDBM50237132(CHEMBL4071959)
Affinity DataIC50: >2.00E+4nM. Assay description: Inhibition of human liver CYP2C9 expressed in Saccharomyces cerevisiae YY7 microsomal membranes using DBF as substrate after 10 mins by fluorescence ...
In DepthDetails ArticlePubMed
TargetCytochrome P450 1A1(Homo sapiens (Human))
De Montfort University
Curated by ChEMBL
LigandPNGBDBM50237132(CHEMBL4071959)
Affinity DataIC50:  958nM. Assay description: Inhibition of human liver CYP1A1 expressed in Saccharomyces cerevisiae YY7 microsomal membranes using 7-ethoxyresorufin as substrate after 10 mins by...
In DepthDetails ArticlePubMed
TargetCytochrome P450 2D6(Homo sapiens (Human))
De Montfort University
Curated by ChEMBL
LigandPNGBDBM50237132(CHEMBL4071959)
Affinity DataIC50:  1.30E+3nM. Assay description: Inhibition of human liver CYP2D6 expressed in Saccharomyces cerevisiae YY7 microsomal membranes using EOMCC as substrate after 10 mins by fluorescenc...
In DepthDetails ArticlePubMed
TargetCytochrome P450 1A2(Homo sapiens (Human))
De Montfort University
Curated by ChEMBL
LigandPNGBDBM50237132(CHEMBL4071959)
Affinity DataIC50:  214nM. Assay description: Inhibition of human liver CYP1A2 expressed in Saccharomyces cerevisiae YY7 microsomal membranes using CEC as substrate after 10 mins by fluorescence ...
In DepthDetails ArticlePubMed
TargetCytochrome P450 3A4(Homo sapiens (Human))
De Montfort University
Curated by ChEMBL
LigandPNGBDBM50237132(CHEMBL4071959)
Affinity DataIC50:  6.00E+3nM. Assay description: Inhibition of human liver CYP3A4 expressed in Saccharomyces cerevisiae YY7 microsomal membranes using DBF as substrate after 10 mins by fluorescence ...
In DepthDetails ArticlePubMed
TargetCytochrome P450 2C19(Homo sapiens (Human))
De Montfort University
Curated by ChEMBL
LigandPNGBDBM50237132(CHEMBL4071959)
Affinity DataIC50: >2.00E+4nM. Assay description: Inhibition of human liver CYP2C19 expressed in Saccharomyces cerevisiae YY7 microsomal membranes using DBF as substrate after 10 mins by fluorescence...
In DepthDetails ArticlePubMed
TargetCytochrome P450 1B1(Homo sapiens (Human))
De Montfort University
Curated by ChEMBL
LigandPNGBDBM50237132(CHEMBL4071959)
Affinity DataIC50:  23nM. Assay description: Inhibition of human liver CYP1B1 expressed in Saccharomyces cerevisiae YY7 microsomal membranes using 7-ethoxyresorufin as substrate after 10 mins by...
In DepthDetails ArticlePubMed