BDBM50237302 CHEMBL4101697
SMILES CC(C)c1ccc(cc1)N1CCc2cc(O)ccc2C1(C)c1ccc(\C=C\C(O)=O)cc1
InChI Key InChIKey=HKXVKUOGCLJVEZ-GIDUJCDVSA-N
Data  4 IC50
  Tab Delimited (TSV)   2D SDfile   Computed 3D by Vconf -m prep SDfile
Find this compound or compounds like it in BindingDB:
Activity Spreadsheet -- Enzyme Inhibition Constant Data from BindingDB
Found 4 hits for monomerid = 50237302
TargetEstrogen receptor(Homo sapiens (Human))
Novartis Institutes For Biomedical Research
Curated by ChEMBL
LigandPNGBDBM50237302(CHEMBL4101697)
Affinity DataIC50:  30nM. Assay description: Antagonist activity at ERalpha in human MCF7 cells assessed as inhibition of estrogen-induced transcription preincubated overnight followed by estrog...
In DepthDetails ArticlePubMed
TargetEstrogen receptor(Homo sapiens (Human))
Novartis Institutes For Biomedical Research
Curated by ChEMBL
LigandPNGBDBM50237302(CHEMBL4101697)
Affinity DataIC50:  0.900nM. Assay description: Induction of ERalpha degradation in human MCF7 cells after 18 to 24 hrs by Western blot analysis
In DepthDetails ArticlePubMed
TargetEstrogen receptor(Homo sapiens (Human))
Novartis Institutes For Biomedical Research
Curated by ChEMBL
LigandPNGBDBM50237302(CHEMBL4101697)
Affinity DataIC50:  2.10nM. Assay description: Induction of ERalpha degradation in human MCF7 cells assessed as inhibition of insulin-mediated cell proliferation after 6 days by Hoechst 33258 dye-...
In DepthDetails ArticlePubMed
TargetEstrogen receptor(Homo sapiens (Human))
Novartis Institutes For Biomedical Research
Curated by ChEMBL
LigandPNGBDBM50237302(CHEMBL4101697)
Affinity DataIC50:  1.80nM. Assay description: Induction of ERalpha degradation in human MCF7 cells after 18 hrs by Western blot analysis
In DepthDetails ArticlePubMed