BDBM50237319 CHEMBL4080245
SMILES CC(C)c1ccc(cn1)N1CCc2cc(O)ccc2C1(C)c1ccc(\C=C\C(O)=O)cc1
InChI Key InChIKey=XYYPAELCIOFYJI-AWNIVKPZSA-N
Data  2 IC50
  Tab Delimited (TSV)   2D SDfile   Computed 3D by Vconf -m prep SDfile
Find this compound or compounds like it in BindingDB:
Activity Spreadsheet -- Enzyme Inhibition Constant Data from BindingDB
Found 2 hits for monomerid = 50237319
TargetEstrogen receptor(Homo sapiens (Human))
Novartis Institutes For Biomedical Research
Curated by ChEMBL
LigandPNGBDBM50237319(CHEMBL4080245)
Affinity DataIC50:  15nM. Assay description: Induction of ERalpha degradation in human MCF7 cells after 18 to 24 hrs by Western blot analysis
In DepthDetails ArticlePubMed
TargetEstrogen receptor(Homo sapiens (Human))
Novartis Institutes For Biomedical Research
Curated by ChEMBL
LigandPNGBDBM50237319(CHEMBL4080245)
Affinity DataIC50:  1.16E+3nM. Assay description: Inhibition of recombinant Cyclin-dependent kinase 1-cyclin B
In DepthDetails ArticlePubMed