BDBM50237330 CHEMBL4101120
SMILES CNC(=O)\C=C\c1ccc(cc1)C1(C)N(CCc2cc(O)ccc12)c1ccc(F)cc1
InChI Key InChIKey=OKYJZTJSOYPGON-LHHJGKSTSA-N
Data  1 IC50
  Tab Delimited (TSV)   2D SDfile   Computed 3D by Vconf -m prep SDfile
Find this compound or compounds like it in BindingDB:
Activity Spreadsheet -- Enzyme Inhibition Constant Data from BindingDB
Found 1 hit for monomerid = 50237330
TargetEstrogen receptor(Homo sapiens (Human))
Novartis Institutes For Biomedical Research
Curated by ChEMBL
LigandPNGBDBM50237330(CHEMBL4101120)
Affinity DataIC50:  120nM. Assay description: Antagonist activity at ERalpha in human MCF7 cells assessed as inhibition of estrogen-induced transcription preincubated overnight followed by estrog...
In DepthDetails ArticlePubMed