BDBM50237655 CHEMBL4091433
SMILES Fc1cccc(\C=N\c2ccc(cc2)C2=NNC(=O)CO2)c1
InChI Key InChIKey=TYLCYCPEXJICTR-GIJQJNRQSA-N
Data  2 IC50
  Tab Delimited (TSV)   2D SDfile   Computed 3D by Vconf -m prep SDfile
Find this compound or compounds like it in BindingDB:
Activity Spreadsheet -- Enzyme Inhibition Constant Data from BindingDB
Found 2 hits for monomerid = 50237655
TargetAmine oxidase [flavin-containing] B(Homo sapiens (Human))
Seoul National University
Curated by ChEMBL
LigandPNGBDBM50237655(CHEMBL4091433)
Affinity DataIC50:  1.53E+3nM. Assay description: Inhibition of recombinant human MAO-B expressed in baculovirus infected BTI insect cells assessed as reduction in H2O2 production using p-tyramine as...
In DepthDetails ArticlePubMed
TargetAmine oxidase [flavin-containing] A(Homo sapiens (Human))
Seoul National University
Curated by ChEMBL
LigandPNGBDBM50237655(CHEMBL4091433)
Affinity DataIC50: >1.00E+5nM. Assay description: Inhibition of recombinant human MAO-A expressed in baculovirus infected BTI insect cells assessed as reduction in H2O2 production using p-tyramine as...
In DepthDetails ArticlePubMed