BDBM50237702 CHEMBL4070220
SMILES COC(=O)C1=C(Nc2ccc(C)cc2C)O\C(=C/c2c[nH]c3ncccc23)C1=O
InChI Key InChIKey=OBMBOKPKGVZWTD-YVLHZVERSA-N
Data  1 IC50
  Tab Delimited (TSV)   2D SDfile   Computed 3D by Vconf -m prep SDfile
Find this compound or compounds like it in BindingDB:
Activity Spreadsheet -- Enzyme Inhibition Constant Data from BindingDB
Found 1 hit for monomerid = 50237702
TargetCell division cycle 7-related protein kinase/Protein DBF4 homolog A(Homo sapiens (Human))
Carna Biosciences
Curated by ChEMBL
LigandPNGBDBM50237702(CHEMBL4070220)
Affinity DataIC50:  3.90nM. Assay description: Inhibition of recombinant human Cdc7 (1 to 574 residues)/human N-terminal GST-tagged ASK (1 to 674 residues) expressed in baculovirus expression syst...
In DepthDetails ArticlePubMed