BDBM50237751 CHEMBL4066543
SMILES CN1[C@H]([C@H](c2cccc(Cl)c2F)[C@]2(C(=O)Nc3cc(Cl)ccc23)C11CCCCC1)c1nc(C(O)=O)c(C)o1
InChI Key InChIKey=HXDRUAKPXCZJIL-QHLUZPDOSA-N
Data  1 KI  1 IC50
  Tab Delimited (TSV)   2D SDfile   Computed 3D by Vconf -m prep SDfile
Find this compound or compounds like it in BindingDB:
Activity Spreadsheet -- Enzyme Inhibition Constant Data from BindingDB
Found 2 hits for monomerid = 50237751
TargetE3 ubiquitin-protein ligase Mdm2(Homo sapiens (Human))
University Of Michigan Comprehensive Cancer Center
Curated by ChEMBL
LigandPNGBDBM50237751(CHEMBL4066543)
Affinity DataKi:  3.10nM. Assay description: Inhibition of [3H]-Ro- 15-1788 binding to recombinant human gamma-aminobutyric-acid A receptor alpha-1-beta-3-gamma-2
In DepthDetails ArticlePubMed
TargetE3 ubiquitin-protein ligase Mdm2(Homo sapiens (Human))
University Of Michigan Comprehensive Cancer Center
Curated by ChEMBL
LigandPNGBDBM50237751(CHEMBL4066543)
Affinity DataIC50:  31nM. Assay description: Inhibition of [3H]-Ro- 15-1788 binding to recombinant human gamma-aminobutyric-acid A receptor alpha-2-beta-3-gamma-2
In DepthDetails ArticlePubMed