BDBM50237762 CHEMBL4072993
SMILES OC(=O)[C@H]1CC[C@H](CNC(=O)[C@@H]2NC3(CCCCC3)[C@]3([C@H]2c2cccc(Cl)c2F)C(=O)Nc2cc(Cl)ccc32)CC1
InChI Key InChIKey=TURZYRGEJPLUDI-BGBDWYERSA-N
Data  1 KI  1 IC50
  Tab Delimited (TSV)   2D SDfile   Computed 3D by Vconf -m prep SDfile
Find this compound or compounds like it in BindingDB:
Activity Spreadsheet -- Enzyme Inhibition Constant Data from BindingDB
Found 2 hits for monomerid = 50237762
TargetE3 ubiquitin-protein ligase Mdm2(Homo sapiens (Human))
University Of Michigan Comprehensive Cancer Center
Curated by ChEMBL
LigandPNGBDBM50237762(CHEMBL4072993)
Affinity DataKi:  2.20nM. Assay description: Evaluated for accumulation of cAMP in transfected HEK293 cells expressing human vasopressin V2 receptor
In DepthDetails ArticlePubMed
TargetE3 ubiquitin-protein ligase Mdm2(Homo sapiens (Human))
University Of Michigan Comprehensive Cancer Center
Curated by ChEMBL
LigandPNGBDBM50237762(CHEMBL4072993)
Affinity DataIC50:  17nM. Assay description: Inhibition of FAM-tagged p53-based PMDM6-F peptide binding to human recombinant His-tagged MDM2 (1 to 118 residues) after 30 mins by fluorescence pol...
In DepthDetails ArticlePubMed