BDBM50237832 CHEMBL1198335
SMILES COc1cccc(Nc2nc(NCC3CCCO3)c3ccccc3n2)c1
InChI Key InChIKey=FBWZAFQEOKNGQL-UHFFFAOYSA-N
Data  5 IC50
  Tab Delimited (TSV)   2D SDfile   Computed 3D by Vconf -m prep SDfile
Find this compound or compounds like it in BindingDB:
Activity Spreadsheet -- Enzyme Inhibition Constant Data from BindingDB
Found 5 hits for monomerid = 50237832
TargetSerine/threonine-protein kinase PAK 4(Homo sapiens (Human))
Shenyang Pharmaceutical University
Curated by ChEMBL
LigandPNGBDBM50237832(CHEMBL1198335)
Affinity DataIC50:  1.45E+4nM. Assay description: Inhibitory activity against HIV-1 integrase
In DepthDetails ArticlePubMed
TargetSerine/threonine-protein kinase PAK 4(Homo sapiens (Human))
Shenyang Pharmaceutical University
Curated by ChEMBL
LigandPNGBDBM50237832(CHEMBL1198335)
Affinity DataIC50:  1.49E+4nM. Assay description: Inhibition of PAK4 (unknown origin) using histone H3 as substrate
In DepthDetails ArticlePubMed
TargetSerine/threonine-protein kinase PAK 1(Homo sapiens (Human))
Arromax Pharmatech
Curated by ChEMBL
LigandPNGBDBM50237832(CHEMBL1198335)
Affinity DataIC50:  48nM. Assay description: Inhibition of PAK1 (unknown origin) assessed as reduction in histone phosphorylation incubated for 1 hr at 4 degC by immunoblotting analysis
In DepthDetails ArticlePubMed
TargetSerine/threonine-protein kinase PAK 4(Homo sapiens (Human))
Shenyang Pharmaceutical University
Curated by ChEMBL
LigandPNGBDBM50237832(CHEMBL1198335)
Affinity DataIC50:  15nM. Assay description: Inhibition of PAK4 (unknown origin) assessed as reduction in histone phosphorylation incubated for 1 hr at 4 degC by immunoblotting analysis
In DepthDetails ArticlePubMed
TargetSerine/threonine-protein kinase PAK 1(Homo sapiens (Human))
Arromax Pharmatech
Curated by ChEMBL
LigandPNGBDBM50237832(CHEMBL1198335)
Affinity DataIC50:  4.84E+4nM. Assay description: Inhibition of PAK1 (unknown origin)
In DepthDetails ArticlePubMed