BDBM50238690 CHEMBL4068681
SMILES CC(C)C[C@H](NC(=O)[C@H](Cc1ccccc1)NC(=O)[C@H](Cc1ccc(O)cc1)NC(=O)CN1CCNCC1)C(=O)N[C@@H](Cc1ccccc1)C(=O)N[C@@H](CCCNC(N)=N)C(=O)N1CCC[C@H]1C(=O)N[C@@H](CCCNC(N)=N)C(=O)N[C@@H](CC(N)=O)C(N)=O
InChI Key InChIKey=ADVMJOYNQRNHGW-VTWSTLNFSA-N
Data  4 EC50
  Tab Delimited (TSV)   2D SDfile   Computed 3D by Vconf -m prep SDfile
Find this compound or compounds like it in BindingDB:
Activity Spreadsheet -- Enzyme Inhibition Constant Data from BindingDB
Found 4 hits for monomerid = 50238690
TargetNeuromedin-U receptor 1(Mus musculus)
Takeda Pharmaceutical
Curated by ChEMBL
LigandPNGBDBM50238690(CHEMBL4068681)
Affinity DataEC50:  0.210nM. Assay description: Agonist activity at mouse NMUR1 expressed in CHO cells assessed as induction of Ca2+ flux measured for 180 secs by Fluo 4-AM dye-based FLIPR assay
In DepthDetails ArticlePubMed
TargetNeuromedin-U receptor 1(Homo sapiens (Human))
Takeda Pharmaceutical
Curated by ChEMBL
LigandPNGBDBM50238690(CHEMBL4068681)
Affinity DataEC50:  0.320nM. Assay description: Agonist activity at human NMUR1 expressed in CHO cells assessed as induction of Ca2+ flux measured for 180 secs by Fluo 4-AM dye-based FLIPR assay
In DepthDetails ArticlePubMed
TargetNeuromedin-U receptor 2(Mus musculus)
Takeda Pharmaceutical
Curated by ChEMBL
LigandPNGBDBM50238690(CHEMBL4068681)
Affinity DataEC50:  0.0560nM. Assay description: Agonist activity at mouse NMUR2 expressed in CHO cells assessed as induction of Ca2+ flux measured for 180 secs by Fluo 4-AM dye-based FLIPR assay
In DepthDetails ArticlePubMed
TargetNeuromedin-U receptor 2(Homo sapiens (Human))
Takeda Pharmaceutical
Curated by ChEMBL
LigandPNGBDBM50238690(CHEMBL4068681)
Affinity DataEC50:  0.220nM. Assay description: Agonist activity at human NMUR2 expressed in CHO cells assessed as induction of Ca2+ flux measured for 180 secs by Fluo 4-AM dye-based FLIPR assay
In DepthDetails ArticlePubMed