BDBM50238695 CHEMBL4079986
SMILES CCCC[C@H](NC(=O)[C@H](CC(C)C)NC(=O)[C@H](Cc1ccccc1)NC(=O)[C@H](Cc1ccc(O)cc1)NC(=O)CCN)C(=O)N[C@@H](CCCNC(N)=N)C(=O)N1CCC[C@H]1C(=O)N[C@@H](CCCNC(N)=N)C(=O)N[C@@H](CC(N)=O)C(N)=O
InChI Key InChIKey=MEZXJJGYHMNUJA-BXXNOCLASA-N
Data  4 EC50
  Tab Delimited (TSV)   2D SDfile   Computed 3D by Vconf -m prep SDfile
Find this compound or compounds like it in BindingDB:
Activity Spreadsheet -- Enzyme Inhibition Constant Data from BindingDB
Found 4 hits for monomerid = 50238695
TargetNeuromedin-U receptor 1(Mus musculus)
Takeda Pharmaceutical
Curated by ChEMBL
LigandPNGBDBM50238695(CHEMBL4079986)
Affinity DataEC50:  3.40nM. Assay description: Agonist activity at mouse NMUR1 expressed in CHO cells assessed as induction of Ca2+ flux measured for 180 secs by Fluo 4-AM dye-based FLIPR assay
In DepthDetails ArticlePubMed
TargetNeuromedin-U receptor 2(Homo sapiens (Human))
Takeda Pharmaceutical
Curated by ChEMBL
LigandPNGBDBM50238695(CHEMBL4079986)
Affinity DataEC50:  0.430nM. Assay description: Agonist activity at human NMUR2 expressed in CHO cells assessed as induction of Ca2+ flux measured for 180 secs by Fluo 4-AM dye-based FLIPR assay
In DepthDetails ArticlePubMed
TargetNeuromedin-U receptor 2(Mus musculus)
Takeda Pharmaceutical
Curated by ChEMBL
LigandPNGBDBM50238695(CHEMBL4079986)
Affinity DataEC50:  0.170nM. Assay description: Agonist activity at mouse NMUR2 expressed in CHO cells assessed as induction of Ca2+ flux measured for 180 secs by Fluo 4-AM dye-based FLIPR assay
In DepthDetails ArticlePubMed
TargetNeuromedin-U receptor 1(Homo sapiens (Human))
Takeda Pharmaceutical
Curated by ChEMBL
LigandPNGBDBM50238695(CHEMBL4079986)
Affinity DataEC50:  1nM. Assay description: Agonist activity at human NMUR1 expressed in CHO cells assessed as induction of Ca2+ flux measured for 180 secs by Fluo 4-AM dye-based FLIPR assay
In DepthDetails ArticlePubMed