BDBM50238713 CHEMBL4070175
SMILES CC(C)C[C@H](NC(=O)[C@H](Cc1ccc2ccccc2c1)NC(=O)[C@H](Cc1ccc(O)cc1)NC(=O)CCN)C(=O)N[C@@H](Cc1ccncc1)C(=O)N[C@@H](CCCNC(N)=N)C(=O)N1CCC[C@H]1C(=O)N[C@@H](CCCNC(N)=N)C(=O)N[C@@H](CC(N)=O)C(N)=O
InChI Key InChIKey=BOGGXPDTHSDHMW-VTWSTLNFSA-N
Data  4 EC50
  Tab Delimited (TSV)   2D SDfile   Computed 3D by Vconf -m prep SDfile
Find this compound or compounds like it in BindingDB:
Activity Spreadsheet -- Enzyme Inhibition Constant Data from BindingDB
Found 4 hits for monomerid = 50238713
TargetNeuromedin-U receptor 1(Mus musculus)
Takeda Pharmaceutical
Curated by ChEMBL
LigandPNGBDBM50238713(CHEMBL4070175)
Affinity DataEC50: >1.00E+3nM. Assay description: Agonist activity at mouse NMUR1 expressed in CHO cells assessed as induction of Ca2+ flux measured for 180 secs by Fluo 4-AM dye-based FLIPR assay
In DepthDetails ArticlePubMed
TargetNeuromedin-U receptor 2(Mus musculus)
Takeda Pharmaceutical
Curated by ChEMBL
LigandPNGBDBM50238713(CHEMBL4070175)
Affinity DataEC50:  4.80nM. Assay description: Agonist activity at mouse NMUR2 expressed in CHO cells assessed as induction of Ca2+ flux measured for 180 secs by Fluo 4-AM dye-based FLIPR assay
In DepthDetails ArticlePubMed
TargetNeuromedin-U receptor 2(Homo sapiens (Human))
Takeda Pharmaceutical
Curated by ChEMBL
LigandPNGBDBM50238713(CHEMBL4070175)
Affinity DataEC50:  0.830nM. Assay description: Agonist activity at human NMUR2 expressed in CHO cells assessed as induction of Ca2+ flux measured for 180 secs by Fluo 4-AM dye-based FLIPR assay
In DepthDetails ArticlePubMed
TargetNeuromedin-U receptor 1(Homo sapiens (Human))
Takeda Pharmaceutical
Curated by ChEMBL
LigandPNGBDBM50238713(CHEMBL4070175)
Affinity DataEC50:  81nM. Assay description: Agonist activity at human NMUR1 expressed in CHO cells assessed as induction of Ca2+ flux measured for 180 secs by Fluo 4-AM dye-based FLIPR assay
In DepthDetails ArticlePubMed