BDBM50238753 CHEMBL4063893
SMILES Cl.COc1ccccc1CNC[C@H]1C[C@@H]1c1cc(F)ccc1OCC=C
InChI Key InChIKey=LJTWQWNBBQLSCX-CLRXKPRGSA-N
Data  7 EC50
  Tab Delimited (TSV)   2D SDfile   Computed 3D by Vconf -m prep SDfile
Find this compound or compounds like it in BindingDB:
Activity Spreadsheet -- Enzyme Inhibition Constant Data from BindingDB
Found 7 hits for monomerid = 50238753
Target5-hydroxytryptamine receptor 2C(Homo sapiens (Human))
University Of Illinois At Chicago
Curated by ChEMBL
LigandPNGBDBM50238753(CHEMBL4063893)
Affinity DataEC50:  9.20nM. Assay description: Agonist activity at tTA containing TEV cleavage site-fused 5-HT2C-INI receptor isoform (unknown origin) expressed in TEV-fused beta-arrestin2 express...
In DepthDetails ArticlePubMed
Target5-hydroxytryptamine receptor 2A(Homo sapiens (Human))
University Of Illinois At Chicago
Curated by ChEMBL
LigandPNGBDBM50238753(CHEMBL4063893)
Affinity DataEC50:  28nM. Assay description: Agonist activity at human 5-HT2A receptor expressed in Flp-IN HEK293 cells assessed as induction of calcium flux measured every second for 5 mins by ...
In DepthDetails ArticlePubMed
Target5-hydroxytryptamine receptor 2A(Homo sapiens (Human))
University Of Illinois At Chicago
Curated by ChEMBL
LigandPNGBDBM50238753(CHEMBL4063893)
Affinity DataEC50:  28nM. Assay description: Agonist activity at human 5-HT2A receptor expressed in Flp-IN HEK293 cells assessed as induction of calcium flux measured every second for 5 mins by ...
In DepthDetails ArticlePubMed
Target5-hydroxytryptamine receptor 2C(Homo sapiens (Human))
University Of Illinois At Chicago
Curated by ChEMBL
LigandPNGBDBM50238753(CHEMBL4063893)
Affinity DataEC50:  23nM. Assay description: Agonist activity at tTA containing TEV cleavage site-fused 5-HT2C-INI receptor isoform (unknown origin) expressed in TEV-fused beta-arrestin2 express...
In DepthDetails ArticlePubMed
Target5-hydroxytryptamine receptor 2B(Homo sapiens (Human))
University Of Illinois At Chicago
Curated by ChEMBL
LigandPNGBDBM50238753(CHEMBL4063893)
Affinity DataEC50:  113nM. Assay description: Agonist activity at human 5-HT2B receptor expressed in Flp-IN HEK293 cells assessed as induction of calcium flux measured every second for 5 mins by ...
In DepthDetails ArticlePubMed
Target5-hydroxytryptamine receptor 2B(Homo sapiens (Human))
University Of Illinois At Chicago
Curated by ChEMBL
LigandPNGBDBM50238753(CHEMBL4063893)
Affinity DataEC50:  112nM. Assay description: Agonist activity at human 5-HT2B receptor expressed in Flp-IN HEK293 cells assessed as induction of calcium flux measured every second for 5 mins by ...
In DepthDetails ArticlePubMed
Target5-hydroxytryptamine receptor 2C(Homo sapiens (Human))
University Of Illinois At Chicago
Curated by ChEMBL
LigandPNGBDBM50238753(CHEMBL4063893)
Affinity DataEC50:  8.90nM. Assay description: Agonist activity at human 5-HT2C-INI receptor isoform expressed in Flp-IN HEK293 cells assessed as induction of Gq-mediated calcium flux measured eve...
In DepthDetails ArticlePubMed