BDBM50238828 CHEMBL4072361
SMILES O[C@@H]1CN[C@@H](C1)c1nc(Cc2ccc(F)cc2Cl)no1
InChI Key InChIKey=WBGOUPRWTBTSAH-ONGXEEELSA-N
Data  1 IC50
  Tab Delimited (TSV)   2D SDfile   Computed 3D by Vconf -m prep SDfile
Find this compound or compounds like it in BindingDB:
Activity Spreadsheet -- Enzyme Inhibition Constant Data from BindingDB
Found 1 hit for monomerid = 50238828
TargetMyeloperoxidase(Homo sapiens (Human))
Universit£
Curated by ChEMBL
LigandPNGBDBM50238828(CHEMBL4072361)
Affinity DataIC50:  4.68E+3nM. Assay description: Inhibition of recombinant MPO (unknown origin) assessed as reduction in taurine chloramine production preincubated with enzyme and taurine followed b...
In DepthDetails ArticlePubMed