BDBM50238842 CHEMBL4090447
SMILES [#6]-c1nc(\[#7]=[#6](/[#7])-[#7])nc2ccc(F)cc12
InChI Key InChIKey=ZRANMLRZCWTDDP-UHFFFAOYSA-N
Data  1 IC50
  Tab Delimited (TSV)   2D SDfile   Computed 3D by Vconf -m prep SDfile
Find this compound or compounds like it in BindingDB:
Activity Spreadsheet -- Enzyme Inhibition Constant Data from BindingDB
Found 1 hit for monomerid = 50238842
TargetMyeloperoxidase(Homo sapiens (Human))
Universit£
Curated by ChEMBL
LigandPNGBDBM50238842(CHEMBL4090447)
Affinity DataIC50:  145nM. Assay description: Inhibition of recombinant MPO (unknown origin) assessed as reduction in taurine chloramine production preincubated with enzyme and taurine followed b...
In DepthDetails ArticlePubMed