BDBM50238843 CHEMBL4068067
SMILES ONC(=O)c1c[nH]c(NCc2cc(cc(c2)C(F)(F)F)C(F)(F)F)nc1=O
InChI Key InChIKey=FNNKXGWDBVPDKY-UHFFFAOYSA-N
Data  1 IC50
  Tab Delimited (TSV)   2D SDfile   Computed 3D by Vconf -m prep SDfile
Find this compound or compounds like it in BindingDB:
Activity Spreadsheet -- Enzyme Inhibition Constant Data from BindingDB
Found 1 hit for monomerid = 50238843
TargetMyeloperoxidase(Homo sapiens (Human))
Universit£
Curated by ChEMBL
LigandPNGBDBM50238843(CHEMBL4068067)
Affinity DataIC50:  5nM. Assay description: Inhibition of recombinant MPO (unknown origin) assessed as reduction in taurine chloramine production preincubated with enzyme and taurine followed b...
In DepthDetails ArticlePubMed