BDBM50239316 CHEMBL4088022
SMILES N#Cc1ccc(Nc2nc(nc3ccccc23)-c2ccccc2)cc1
InChI Key InChIKey=IHEBYSXJXPXZKN-UHFFFAOYSA-N
Data  5 IC50  4 EC50
  Tab Delimited (TSV)   2D SDfile   Computed 3D by Vconf -m prep SDfile
Find this compound or compounds like it in BindingDB:
Activity Spreadsheet -- Enzyme Inhibition Constant Data from BindingDB
Found 9 hits for monomerid = 50239316
TargetBroad substrate specificity ATP-binding cassette transporter ABCG2(Homo sapiens (Human))
University Of Bonn
Curated by ChEMBL
LigandPNGBDBM50239316(CHEMBL4088022)
Affinity DataIC50:  71nM. Assay description: Inhibition of recombinant human GFP-fused ABCG2 expressed in MDCK2 cells assessed as reduction in Hoechst 33342 efflux preincubated for 30 mins follo...
In DepthDetails ArticlePubMed
TargetBroad substrate specificity ATP-binding cassette transporter ABCG2(Homo sapiens (Human))
University Of Bonn
Curated by ChEMBL
LigandPNGBDBM50239316(CHEMBL4088022)
Affinity DataIC50:  85nM. Assay description: Inhibition of c-terminal GFP-tagged human ABCG2 expressed in MDCK2 cells preincubated for 30 mins before Pheophorbide A addition by Pheophorbide A as...
In DepthDetails ArticlePubMed
TargetBroad substrate specificity ATP-binding cassette transporter ABCG2(Homo sapiens (Human))
University Of Bonn
Curated by ChEMBL
LigandPNGBDBM50239316(CHEMBL4088022)
Affinity DataIC50:  85nM. Assay description: Inhibition of c-terminal GFP-tagged human ABCG2 expressed in MDCK2 cells preincubated for 30 mins before Pheophorbide A addition by Pheophorbide A as...
In DepthDetails ArticlePubMed
TargetBroad substrate specificity ATP-binding cassette transporter ABCG2(Homo sapiens (Human))
University Of Bonn
Curated by ChEMBL
LigandPNGBDBM50239316(CHEMBL4088022)
Affinity DataEC50:  53nM. Assay description: Inhibition of c-terminal GFP-tagged human ABCG2 expressed in MDCK2 cells assessed as enhancement of Hoechst 33342-induced cytotoxicity incubated for ...
In DepthDetails ArticlePubMed
TargetBroad substrate specificity ATP-binding cassette transporter ABCG2(Homo sapiens (Human))
University Of Bonn
Curated by ChEMBL
LigandPNGBDBM50239316(CHEMBL4088022)
Affinity DataIC50:  70nM. Assay description: Inhibition of c-terminal GFP-tagged human ABCG2 expressed in MDCK2 cells preincubated for 30 mins before Hoechst 33342 addition by Hoechst 33342 accu...
In DepthDetails ArticlePubMed
TargetBroad substrate specificity ATP-binding cassette transporter ABCG2(Homo sapiens (Human))
University Of Bonn
Curated by ChEMBL
LigandPNGBDBM50239316(CHEMBL4088022)
Affinity DataEC50:  41nM. Assay description: Inhibition of c-terminal GFP-tagged human ABCG2 expressed in MDCK2 cells assessed as enhancement of SN-38-induced cytotoxicity incubated for 72 hrs b...
In DepthDetails ArticlePubMed
TargetBroad substrate specificity ATP-binding cassette transporter ABCG2(Homo sapiens (Human))
University Of Bonn
Curated by ChEMBL
LigandPNGBDBM50239316(CHEMBL4088022)
Affinity DataIC50:  70nM. Assay description: Inhibition of c-terminal GFP-tagged human ABCG2 expressed in MDCK2 cells preincubated for 30 mins before Hoechst 33342 addition by Hoechst 33342 accu...
In DepthDetails ArticlePubMed
TargetBroad substrate specificity ATP-binding cassette transporter ABCG2(Homo sapiens (Human))
University Of Bonn
Curated by ChEMBL
LigandPNGBDBM50239316(CHEMBL4088022)
Affinity DataEC50:  41nM. Assay description: Inhibition of c-terminal GFP-tagged human ABCG2 expressed in MDCK2 cells assessed as enhancement of SN-38-induced cytotoxicity incubated for 72 hrs b...
In DepthDetails ArticlePubMed
TargetBroad substrate specificity ATP-binding cassette transporter ABCG2(Homo sapiens (Human))
University Of Bonn
Curated by ChEMBL
LigandPNGBDBM50239316(CHEMBL4088022)
Affinity DataEC50:  53nM. Assay description: Inhibition of c-terminal GFP-tagged human ABCG2 expressed in MDCK2 cells assessed as enhancement of Hoechst 33342-induced cytotoxicity incubated for ...
In DepthDetails ArticlePubMed