BDBM50239511 CHEMBL4065129
SMILES Cc1ccccc1S(=O)(=O)N1CCN(CC1)c1ccc(nn1)C(=O)NCc1ccccc1
InChI Key InChIKey=LUNTUWSUYAYIBG-UHFFFAOYSA-N
Data  2 IC50
  Tab Delimited (TSV)   2D SDfile   Computed 3D by Vconf -m prep SDfile
Find this compound or compounds like it in BindingDB:
Activity Spreadsheet -- Enzyme Inhibition Constant Data from BindingDB
Found 2 hits for monomerid = 50239511
TargetStearoyl-CoA desaturase(Homo sapiens (Human))
Karolinska Institutet
Curated by ChEMBL
LigandPNGBDBM50239511(CHEMBL4065129)
Affinity DataIC50:  1.97E+4nM. Assay description: Inhibition of SCD1 in human HepG2 cells assessed as ratio of cellular protein product over substrate after 72 hrs
In DepthDetails ArticlePubMed
TargetdCTP pyrophosphatase 1(Homo sapiens (Human))
Karolinska Institutet
Curated by ChEMBL
LigandPNGBDBM50239511(CHEMBL4065129)
Affinity DataIC50:  170nM. Assay description: Inhibition of human full length N-terminal His-tagged dCTPase expressed in Escherichia coli BL21(DE3) using dCTP as substrate by HTS-based malachite ...
In DepthDetails ArticlePubMed