BDBM50239714 CHEMBL4094948
SMILES COC(=O)CC[C@H]1NC(=O)c2cc(Oc3cccc(c3)N(C)C)c(NC(=O)COCc3cccc(Br)c3)cc2NC1=O
InChI Key InChIKey=PJUZEKNSYQMUFS-HSZRJFAPSA-N
Data  2 IC50
  Tab Delimited (TSV)   2D SDfile   Computed 3D by Vconf -m prep SDfile
Find this compound or compounds like it in BindingDB:
Activity Spreadsheet -- Enzyme Inhibition Constant Data from BindingDB
Found 2 hits for monomerid = 50239714
TargetNucleotide-binding oligomerization domain-containing protein 2(Homo sapiens (Human))
Chinese Academy Of Medical Sciences And Peking Union Medical College
Curated by ChEMBL
LigandPNGBDBM50239714(CHEMBL4094948)
Affinity DataIC50:  2.28E+3nM. Assay description: Antagonist activity at human NOD2 expressed in HEK-Blue cells assessed as inhibition of MDP-stimulated cell activation preincubated for 3 hrs followe...
In DepthDetails ArticlePubMed
TargetNucleotide-binding oligomerization domain-containing protein 1(Homo sapiens (Human))
Chinese Academy Of Medical Sciences And Peking Union Medical College
Curated by ChEMBL
LigandPNGBDBM50239714(CHEMBL4094948)
Affinity DataIC50:  1.33E+3nM. Assay description: Antagonist activity at human NOD1 expressed in HEK-blue cells assessed as inhibition of C12-iE-DAP-stimulated cell activation preincubated for 3 hrs ...
In DepthDetails ArticlePubMed