BDBM50239766 CHEMBL4072819
SMILES Cn1c2ccccc2c(O)c(C(=O)NNC(=O)Cc2ccccc2)c1=O
InChI Key InChIKey=RKQRCXFVIUUOAW-UHFFFAOYSA-N
Data  1 IC50
  Tab Delimited (TSV)   2D SDfile   Computed 3D by Vconf -m prep SDfile
Find this compound or compounds like it in BindingDB:
Activity Spreadsheet -- Enzyme Inhibition Constant Data from BindingDB
Found 1 hit for monomerid = 50239766
TargetGlycogen synthase kinase-3 beta(Homo sapiens (Human))
Centro De Investigaciones Biol�Gicas-Csic
Curated by ChEMBL
LigandPNGBDBM50239766(CHEMBL4072819)
Affinity DataIC50: >2.00E+4nM. Assay description: Allosteric inhibition of human recombinant full length N-terminal GST-tagged GSK3beta expressed in fall armyworm Sf9 cells after 30 min in presence o...
In DepthDetails ArticlePubMed