BDBM50241634 CHEMBL4068103
SMILES N[C@@H]1[C@@H](O)[C@H](O)[C@@H](CO)O[C@H]1c1nc(n[nH]1)-c1ccc2ccccc2c1
InChI Key InChIKey=IMNCDLXOKIGZHY-OXGONZEZSA-N
Data  3 KI
PDB links: 1 PDB ID matches this monomer.
  Tab Delimited (TSV)   2D SDfile   Computed 3D by Vconf -m prep SDfile
Find this compound or compounds like it in BindingDB:
Activity Spreadsheet -- Enzyme Inhibition Constant Data from BindingDB
Found 3 hits for monomerid = 50241634
TargetGlycogen phosphorylase, muscle form(Oryctolagus cuniculus (rabbit))
University Of Debrecen
Curated by ChEMBL
LigandPNGBDBM50241634(CHEMBL4068103)
Affinity DataKi:  4.80E+3nM. Assay description: Inhibition of ADP-induced platelet aggregation in human platelet-rich plasma
TargetGlycogen phosphorylase, muscle form(Oryctolagus cuniculus (rabbit))
University Of Debrecen
Curated by ChEMBL
LigandPNGBDBM50241634(CHEMBL4068103)
Affinity DataKi:  5.30E+3nM. Assay description: The compound was tested for the inhibition of fibrinogen receptor
TargetGlycogen phosphorylase, liver form(Homo sapiens (Human))
University Of Debrecen
Curated by ChEMBL
LigandPNGBDBM50241634(CHEMBL4068103)
Affinity DataKi:  7.60E+3nM. Assay description: Competitive inhibition of 6xHis-tagged human liver glycogen phosphorylase-a expressed in Escherichia coli BL21 Gold (DE3) assessed as release of inor...
In DepthDetails ArticlePubMed