BDBM50241746 15-amido-3-demethoxy-2alpha,3alpha-methylenedioxyerythroculine::CHEMBL465625
SMILES COc1cc2CCN3CCC4=C[C@@H]5OCO[C@@H]5C[C@]34c2cc1C(N)=O
InChI Key InChIKey=QCGHEAJFTHQMHI-SCTDSRPQSA-N
Data  1 IC50
  Tab Delimited (TSV)   2D SDfile   Computed 3D by Vconf -m prep SDfile
Find this compound or compounds like it in BindingDB:
Activity Spreadsheet -- Enzyme Inhibition Constant Data from BindingDB
Found 1 hit for monomerid = 50241746
TargetNeuronal acetylcholine receptor subunit alpha-3(Rattus norvegicus (Rat))
Glaxosmithkline
Curated by ChEMBL
LigandPNGBDBM50241746(15-amido-3-demethoxy-2alpha,3alpha-methylenedioxye...)
Affinity DataIC50:  9.40E+4nM. Assay description: Antagonist activity at rat alpha3beta4 nicotinic receptor expressed in KXalpha3beta4R2 cells assessed as nicotine-induced calcium fluorescence
In DepthDetails ArticlePubMed