BDBM50241792 CHEMBL4102148
SMILES CCOc1ccc(F)c2[C@@H](CN)OB(O)c12
InChI Key InChIKey=DMAVCLMJKGWOIF-MRVPVSSYSA-N
Data  1 IC50
  Tab Delimited (TSV)   2D SDfile   Computed 3D by Vconf -m prep SDfile
Find this compound or compounds like it in BindingDB:
Activity Spreadsheet -- Enzyme Inhibition Constant Data from BindingDB
Found 1 hit for monomerid = 50241792
TargetLeucine--tRNA ligase(Mycobacterium tuberculosis (strain ATCC 25618 / H3...)
Anacor Pharmaceuticals
Curated by ChEMBL
LigandPNGBDBM50241792(CHEMBL4102148)
Affinity DataIC50:  80nM. Assay description: Inhibition of Mycobacterium tuberculosis H37Rv N-terminal 6His-tagged LeuRS expressed in Escherichia coli BL21(DE3) assessed as L-[14C]leucine incorp...
In DepthDetails ArticlePubMed