BDBM50242196 CHEMBL4069423
SMILES OC(=O)CCc1nc2cc(Cl)ccc2s1
InChI Key InChIKey=UMBLVHSXXWQLDL-UHFFFAOYSA-N
Data  2 IC50  2 Kd
PDB links: 2 PDB IDs match this monomer.
  Tab Delimited (TSV)   2D SDfile   Computed 3D by Vconf -m prep SDfile
Find this compound or compounds like it in BindingDB:
Activity Spreadsheet -- Enzyme Inhibition Constant Data from BindingDB
Found 4 hits for monomerid = 50242196
TargetHistone deacetylase 6(Homo sapiens (Human))
Entremed
Curated by ChEMBL
LigandPNGBDBM50242196(CHEMBL4069423)
Affinity DataKd:  4.00E+4nM. Assay description: Inhibition of HIV-1 protease in 5%DMSO
TargetHistone deacetylase 6(Homo sapiens (Human))
Entremed
Curated by ChEMBL
LigandPNGBDBM50242196(CHEMBL4069423)
Affinity DataIC50:  5.50E+4nM. Assay description: Displacement of N-terminal FITC-labeled RLRGG from N-terminal AviTag/C-terminal His6-tagged HDAC6 ZnF-UBD (unknown origin) expressed in Escherichia c...
TargetHistone deacetylase 6(Homo sapiens (Human))
Entremed
Curated by ChEMBL
LigandPNGBDBM50242196(CHEMBL4069423)
Affinity DataIC50:  5.50E+4nM. Assay description: Inhibition of HIV-1 protease in 5%DMSO
TargetHistone deacetylase 6(Homo sapiens (Human))
Entremed
Curated by ChEMBL
LigandPNGBDBM50242196(CHEMBL4069423)
Affinity DataKd:  6.00E+4nM. Assay description: Binding affinity to N-terminal Avi-tagged/C-terminal His6-tagged HDAC6 zinc-finger ubiquitin binding domain (1109 to 1215 residues)(unknown origin) e...