BDBM50242308 CHEMBL4072533
SMILES CC[C@H]1[C@@H](O)CC(=O)N1c1ccc(C#N)c(Cl)c1
InChI Key InChIKey=CVAGOWUXEANSJG-RYUDHWBXSA-N
Data  1 IC50  1 EC50
  Tab Delimited (TSV)   2D SDfile   Computed 3D by Vconf -m prep SDfile
Find this compound or compounds like it in BindingDB:
Activity Spreadsheet -- Enzyme Inhibition Constant Data from BindingDB
Found 2 hits for monomerid = 50242308
TargetAndrogen receptor(Homo sapiens (Human))
Takeda Pharmaceutical
Curated by ChEMBL
LigandPNGBDBM50242308(CHEMBL4072533)
Affinity DataEC50:  6nM. Assay description: Agonist activity at human AR expressed in African green monkey COS7 cells after 24 hrs by luciferase reporter gene assay
In DepthDetails ArticlePubMed
TargetAndrogen receptor(Homo sapiens (Human))
Takeda Pharmaceutical
Curated by ChEMBL
LigandPNGBDBM50242308(CHEMBL4072533)
Affinity DataIC50:  3.90nM. Assay description: Displacement of [3H]mibolerone from human AR after 3 hrs
In DepthDetails ArticlePubMed