BDBM50242415 CHEMBL504627::SNQWIGPALPQH
SMILES CC[C@H](C)[C@H](NC(=O)[C@H](Cc1c[nH]c2ccccc12)NC(=O)[C@H](CCC(N)=O)NC(=O)[C@H](CC(N)=O)NC(=O)[C@@H](N)CO)C(=O)NCC(=O)N1CCC[C@H]1C(=O)N[C@@H](C)C(=O)N[C@@H](CC(C)C)C(=O)N1CCC[C@H]1C(=O)N[C@@H](CCC(N)=O)C(=O)N[C@@H](Cc1cnc[nH]1)C(O)=O
InChI Key InChIKey=OVCHWIUJPVCEAA-BVGDWGTRSA-N
Data  1 Kd
  Tab Delimited (TSV)   2D SDfile   Computed 3D by Vconf -m prep SDfile
Find this compound or compounds like it in BindingDB:
Activity Spreadsheet -- Enzyme Inhibition Constant Data from BindingDB
Found 1 hit for monomerid = 50242415
TargetEphrin type-B receptor 2(Homo sapiens (Human))
The Scripps Research Institute
Curated by ChEMBL
LigandPNGBDBM50242415(CHEMBL504627 | SNQWIGPALPQH)
Affinity DataKd: >5.00E+4nM. Assay description: Binding affinity at human EphB2 receptor by isothermal titration calorimetry
In DepthDetails ArticlePubMed