BDBM50242518 (2S,4S)-4-Fluoro-1-{N-[1-(hydroxymethyl)cyclopentyl]glycyl}pyrrolidine-2-carbonitrile::CHEMBL513725
SMILES OCC1(CCCC1)NCC(=O)N1C[C@@H](F)C[C@H]1C#N
InChI Key InChIKey=SVTBDUVUVVRIBZ-QWRGUYRKSA-N
Data  1 IC50
  Tab Delimited (TSV)   2D SDfile   Computed 3D by Vconf -m prep SDfile
Find this compound or compounds like it in BindingDB:
Activity Spreadsheet -- Enzyme Inhibition Constant Data from BindingDB
Found 1 hit for monomerid = 50242518
TargetDipeptidyl peptidase 4(Homo sapiens (Human))
Taisho Pharmaceutical
Curated by ChEMBL
LigandPNGBDBM50242518((2S,4S)-4-Fluoro-1-{N-[1-(hydroxymethyl)cyclopenty...)
Affinity DataIC50:  3.30nM. Assay description: Inhibition of DPP4 in human plasma by fluorescence assay
In DepthDetails ArticlePubMed