BDBM50242932 (S)-2-amino-3-(4-(6-(3-(cyclopentyloxy)-4-methoxybenzylamino)pyridazin-3-yl)phenyl)propanoic acid::CHEMBL511960
SMILES COc1ccc(CNc2ccc(nn2)-c2ccc(C[C@H](N)C(O)=O)cc2)cc1OC1CCCC1
InChI Key InChIKey=LQTDIHXAVWWONG-NRFANRHFSA-N
Data  1 IC50
  Tab Delimited (TSV)   2D SDfile   Computed 3D by Vconf -m prep SDfile
Find this compound or compounds like it in BindingDB:
Activity Spreadsheet -- Enzyme Inhibition Constant Data from BindingDB
Found 1 hit for monomerid = 50242932
TargetTryptophan 5-hydroxylase 1(Homo sapiens (Human))
Lexicon Pharmaceuticals
Curated by ChEMBL
LigandPNGBDBM50242932((S)-2-amino-3-(4-(6-(3-(cyclopentyloxy)-4-methoxyb...)
Affinity DataIC50:  970nM. Assay description: Inhibition of TPH1 (unknown origin)
In DepthDetails ArticlePubMed