BDBM50243184 {[2-Bromo-4-(40-bromo-30-sulfamoylbiphenyl-4-ylmethylsulfanylmethyl)-ylmethylsulfanylmethyl)-
SMILES NS(=O)(=O)c1cc(ccc1Br)-c1ccc(CSCc2ccc(c(Br)c2)C(F)(F)P([O-])([O-])=O)cc1
InChI Key InChIKey=QJICRYSMSOKYFC-UHFFFAOYSA-L
Data  1 IC50
  Tab Delimited (TSV)   2D SDfile   Computed 3D by Vconf -m prep SDfile
Find this compound or compounds like it in BindingDB:
Activity Spreadsheet -- Enzyme Inhibition Constant Data from BindingDB
Found 1 hit for monomerid = 50243184
TargetTyrosine-protein phosphatase non-receptor type 1(Homo sapiens (Human))
University Of Waterloo
Curated by ChEMBL
LigandPNGBDBM50243184({[2-Bromo-4-(40-bromo-30-sulfamoylbiphenyl-4-ylmet...)
Affinity DataIC50:  6nM. Assay description: Inhibition of human PTP1B expressed in Escherichia coli BL21(DE3) cells
Ligand InfoPC cidPC sid
In DepthDetails ArticlePubMed