BDBM50243361 1-[4-(7-Amino-3-cyano-pyrazolo[1,5-a]pyrimidin-6-yl)-phenyl]-3-m-tolyl-urea::CHEMBL453577
SMILES Cc1cccc(NC(=O)Nc2ccc(cc2)-c2cnc3c(cnn3c2N)C#N)c1
InChI Key InChIKey=KSBSGLXHUHQWSU-UHFFFAOYSA-N
Data  1 IC50
  Tab Delimited (TSV)   2D SDfile   Computed 3D by Vconf -m prep SDfile
Find this compound or compounds like it in BindingDB:
Activity Spreadsheet -- Enzyme Inhibition Constant Data from BindingDB
Found 1 hit for monomerid = 50243361
TargetVascular endothelial growth factor receptor 2(Homo sapiens (Human))
Abbott Laboratories
Curated by ChEMBL
LigandPNGBDBM50243361(1-[4-(7-Amino-3-cyano-pyrazolo[1,5-a]pyrimidin-6-y...)
Affinity DataIC50:  930nM. Assay description: Inhibition of KDR (unknown origin) by HTRF assay
In DepthDetails ArticlePubMed