BDBM50243506 (S)-2-amino-3-(4-(5-(furan-3-ylmethyl amino)pyrazin-2-yl)phenyl)propanoic acid::CHEMBL459441
SMILES N[C@@H](Cc1ccc(cc1)-c1cnc(NCc2ccoc2)cn1)C(O)=O
InChI Key InChIKey=HYQZBTQOPVVOQX-HNNXBMFYSA-N
Data  1 IC50
  Tab Delimited (TSV)   2D SDfile   Computed 3D by Vconf -m prep SDfile
Find this compound or compounds like it in BindingDB:
Activity Spreadsheet -- Enzyme Inhibition Constant Data from BindingDB
Found 1 hit for monomerid = 50243506
TargetTryptophan 5-hydroxylase 1(Homo sapiens (Human))
Lexicon Pharmaceuticals
Curated by ChEMBL
LigandPNGBDBM50243506((S)-2-amino-3-(4-(5-(furan-3-ylmethyl amino)pyrazi...)
Affinity DataIC50:  960nM. Assay description: Inhibition of TPH1 (unknown origin)
In DepthDetails ArticlePubMed