BDBM50243644 CHEMBL4066563
SMILES Cc1c(nc(-c2ccc(Cl)cc2Cl)n1-c1ccc(OS(=O)(=O)CCC(F)(F)F)cc1)C(=O)Nc1ccc(nc1)C(F)(F)F
InChI Key InChIKey=FYBAZEDXQYCNPJ-UHFFFAOYSA-N
Data  2 KI  2 IC50
  Tab Delimited (TSV)   2D SDfile   Computed 3D by Vconf -m prep SDfile
Find this compound or compounds like it in BindingDB:
Activity Spreadsheet -- Enzyme Inhibition Constant Data from BindingDB
Found 4 hits for monomerid = 50243644
TargetCannabinoid receptor 1(Homo sapiens (Human))
Leiden University
Curated by ChEMBL
LigandPNGBDBM50243644(CHEMBL4066563)
Affinity DataKi:  0.310nM. Assay description: Inhibition of [3H]dopamine uptake at dopamine transporter.
In DepthDetails ArticlePubMed
TargetCannabinoid receptor 1(Homo sapiens (Human))
Leiden University
Curated by ChEMBL
LigandPNGBDBM50243644(CHEMBL4066563)
Affinity DataKi:  0.316nM. Assay description: Displacement of [3H]CP55940 from recombinant human CB1 receptor expressed in beta-galactosidase expressing CHOK1 cell membranes after 60 mins by scin...
In DepthDetails ArticlePubMed
TargetCannabinoid receptor 1(Homo sapiens (Human))
Leiden University
Curated by ChEMBL
LigandPNGBDBM50243644(CHEMBL4066563)
Affinity DataIC50:  2nM. Assay description: Antagonist activity at recombinant human CB1 receptor expressed in HEK293 cell membranes assessed as inhibition of CP55940-induced [35S]GTPgammaS bin...
In DepthDetails ArticlePubMed
TargetCannabinoid receptor 1(Homo sapiens (Human))
Leiden University
Curated by ChEMBL
LigandPNGBDBM50243644(CHEMBL4066563)
Affinity DataIC50:  2.20nM. Assay description: Potency for the inhibition of [3H]WIN-35428 binding to the dopamine transporter
In DepthDetails ArticlePubMed