BDBM50243723 4-[(3-Chlorobenzyl)amino]-2-[(4-morpholin-4-ylphenyl)amino]pyrimidine-5-carboxamide::CHEMBL471559
SMILES NC(=O)c1cnc(Nc2ccc(cc2)N2CCOCC2)nc1NCc1cccc(Cl)c1
InChI Key InChIKey=NJNMHHZGWZFCAU-UHFFFAOYSA-N
Data  1 IC50
  Tab Delimited (TSV)   2D SDfile   Computed 3D by Vconf -m prep SDfile
Find this compound or compounds like it in BindingDB:
Activity Spreadsheet -- Enzyme Inhibition Constant Data from BindingDB
Found 1 hit for monomerid = 50243723
TargetSignal transducer and activator of transcription 6(Homo sapiens (Human))
Astellas Pharma
Curated by ChEMBL
LigandPNGBDBM50243723(4-[(3-Chlorobenzyl)amino]-2-[(4-morpholin-4-ylphen...)
Affinity DataIC50:  36nM. Assay description: Inhibition of STAT6 activation (unknown origin) in FW4 reporter cells
In DepthDetails ArticlePubMed