BDBM50243743 CHEMBL4072036
SMILES CCN(CCc1ccc(Cl)cc1)C1CCN(CC1)c1nc(N)n[nH]1
InChI Key InChIKey=KYBGEYBWDDUHRS-UHFFFAOYSA-N
Data  4 IC50
  Tab Delimited (TSV)   2D SDfile   Computed 3D by Vconf -m prep SDfile
Find this compound or compounds like it in BindingDB:
Activity Spreadsheet -- Enzyme Inhibition Constant Data from BindingDB
Found 4 hits for monomerid = 50243743
TargetChitotriosidase-1(Mus musculus)
Oncoarendi Therapeutics
Curated by ChEMBL
LigandPNGBDBM50243743(CHEMBL4072036)
Affinity DataIC50:  7.08E+3nM. Assay description: Inhibition of mouse recombinant full length C-terminal His-tagged chitotriosidase expressed in CHO-K1 cells using 4-methylumbelliferyl-beta-D-N,N',N\...
In DepthDetails ArticlePubMed
TargetAcidic mammalian chitinase(Mus musculus)
Oncoarendi Therapeutics
Curated by ChEMBL
LigandPNGBDBM50243743(CHEMBL4072036)
Affinity DataIC50:  95nM. Assay description: Inhibition of mouse recombinant full length C-terminal His-tagged acidic mammalian chitinase expressed in CHO-K1 cells using 4-methylumbelliferyl-bet...
In DepthDetails ArticlePubMed
TargetChitotriosidase-1(Homo sapiens (Human))
Oncoarendi Therapeutics
Curated by ChEMBL
LigandPNGBDBM50243743(CHEMBL4072036)
Affinity DataIC50:  385nM. Assay description: Inhibition of human recombinant full length C-terminal His-tagged chitotriosidase expressed in CHO-K1 cells using 4-methylumbelliferyl-beta-D-N,N',N\...
In DepthDetails ArticlePubMed
TargetAcidic mammalian chitinase(Homo sapiens (Human))
Oncoarendi Therapeutics
Curated by ChEMBL
LigandPNGBDBM50243743(CHEMBL4072036)
Affinity DataIC50:  182nM. Assay description: Inhibition of human recombinant full length C-terminal His-tagged acidic mammalian chitinase expressed in CHO-K1 cells using 4-methylumbelliferyl-bet...
In DepthDetails ArticlePubMed